{"text_format":"1","workbook":"xlsx","n_sheets":3,"sheets":["Data","Summary","Summary2"],"not_rendered":{"charts":0,"images":0,"macros":1,"external_links":1,"defined_names":5,"comments":0,"pivot_tables":0},"unopened":[],"bounds":{"document_bytes":16777216,"sheet_cells":100000,"rows_first":2000,"rows_last":500,"rows_between":2000,"halvings":0,"cell_chars":16384,"cell_head_chars":4096},"cells_cut":0,"cells_raw":0,"read":"whole","date_system":"1900"}

{"sheet":"Data","index":0,"n_rows":103,"n_cols":4,"rows_kept":103,"cut":false,"hidden":false,"merged":[]}
[]
[null,"Table1"]
[null,"Invoice","NName","Model"]
[null,"B2295","Brown",{"$f":"INDEX(UpK,RANDBETWEEN(1,16))&INDEX(UpK,RANDBETWEEN(1,16))&RANDBETWEEN(1000,9999)","v":"MN2687"}]
[null,"B2295","Brown","KB2757"]
[null,"B2295","Brown","SH2930"]
[null,"D4022","Johnson","KD4957"]
[null,"D4022","Johnson","KG3710"]
[null,"D4022","Johnson","RT1785"]
[null,"D4022","Johnson","FB7680"]
[null,"D4022","Johnson","NS8368"]
[null,"D4022","Johnson","GW5716"]
[null,"F4443","Williams","JK2705"]
[null,"F4443","Williams","FJ6846"]
[null,"F4443","Williams","BJ5282"]
[null,"F4443","Williams","JN9626"]
[null,"F4443","Williams","HH1701"]
[null,"F4443","Williams","GL1431"]
[null,"F4443","Williams","WG7991"]
[null,"F4443","Williams","PD4659"]
[null,"F6360","Williams","HS3014"]
[null,"F6360","Williams","GJ2169"]
[null,"F7379","Jones","RJ1398"]
[null,"F7379","Jones","MJ2036"]
[null,"F8638","Johnson","VH2960"]
[null,"F8638","Johnson","WN2551"]
[null,"G4539","Smith","KP1064"]
[null,"G4539","Smith","GD5721"]
[null,"G4539","Smith","FN9582"]
[null,"G4539","Smith","DK2695"]
[null,"G8764","Brown","JJ8618"]
[null,"G8764","Brown","NS6888"]
[null,"J4018","Jones","KF9724"]
[null,"J4018","Jones","SW8698"]
[null,"J4018","Jones","HW2016"]
[null,"J4018","Jones",{"$f":"INDEX(UpK,RANDBETWEEN(1,16))&INDEX(UpK,RANDBETWEEN(1,16))&RANDBETWEEN(1000,9999)","v":"WJ4182"}]
[null,"K6645","Jones","JF8473"]
[null,"K6645","Jones","FS1717"]
[null,"K6645","Jones","GK4695"]
[null,"K6645","Jones","BN1500"]
[null,"K6645","Jones","DH2791"]
[null,"K6722","Brown","NG8611"]
[null,"K6722","Brown","RR7266"]
[null,"K6722","Brown","MN7539"]
[null,"K6722","Brown","HB9764"]
[null,"K8971","Jones","RV7402"]
[null,"K8971","Jones","RF2526"]
[null,"L1269","Williams","FB1396"]
[null,"L1269","Williams","DR5541"]
[null,"L1269","Williams","SW8854"]
[null,"L1269","Williams","LV2644"]
[null,"L3367","Smith","JB7762"]
[null,"L3367","Smith","GB9810"]
[null,"M2467","Johnson","LL3046"]
[null,"M2467","Johnson","PN1256"]
[null,"M2467","Johnson","JL1674"]
[null,"M2467","Johnson","BH1539"]
[null,"M6827","Smith","KF7842"]
[null,"M6827","Smith","SG5311"]
[null,"M6827","Smith","HK7124"]
[null,"M6827","Smith","BP6523"]
[null,"N2321","Brown","WL3736"]
[null,"N2321","Brown","GK4424"]
[null,"N2321","Brown","BF2985"]
[null,"N2321","Brown","GS2199"]
[null,"N2321","Brown","BB4067"]
[null,"N2321","Brown","VW9703"]
[null,"N6026","Johnson",{"$f":"INDEX(UpK,RANDBETWEEN(1,16))&INDEX(UpK,RANDBETWEEN(1,16))&RANDBETWEEN(1000,9999)","v":"MN8024"}]
[null,"N6026","Johnson","RV2312"]
[null,"N7259","Brown","KT3956"]
[null,"N7259","Brown","LG1204"]
[null,"N7259","Brown","SW1086"]
[null,"N7259","Brown","WT9086"]
[null,"P8139","Johnson","DT8116"]
[null,"P8139","Johnson","SS2673"]
[null,"P8139","Johnson","DG3488"]
[null,"P8139","Johnson","SF2154"]
[null,"P8139","Johnson","FW7480"]
[null,"R1994","Smith","BS4143"]
[null,"R1994","Smith","DH2741"]
[null,"R1994","Smith","GB8225"]
[null,"R1994","Smith","SH2431"]
[null,"R1994","Smith","BW8254"]
[null,"R1994","Smith","PK6311"]
[null,"R1994","Smith","MV3627"]
[null,"R3002","Williams","FM1530"]
[null,"R3002","Williams","MV3297"]
[null,"R7783","Williams","ND6263"]
[null,"R7783","Williams","RG4204"]
[null,"R7783","Williams","PN9928"]
[null,"R7783","Williams","WT3845"]
[null,"T3604","Jones","JW9576"]
[null,"T3604","Jones","KR7839"]
[null,"T3604","Jones","LH7406"]
[null,"T3604","Jones","VH4082"]
[null,"T3604","Jones","VG9646"]
[null,"T3604","Jones","KM8166"]
[null,"V6492","Smith","FF6085"]
[null,"V6492","Smith","RF3584"]
[null,"V6492","Smith","WJ7871"]
[null,{"$f":"INDEX(UpK,RANDBETWEEN(1,16))&RANDBETWEEN(1000,9999)","v":"F1509"},{"$f":"INDEX(LstNm,RANDBETWEEN(1,137))","v":"Hill"},"GK5418"]
[null,{"$f":"INDEX(UpK,RANDBETWEEN(1,16))&RANDBETWEEN(1000,9999)","v":"L3245"},{"$f":"INDEX(LstNm,RANDBETWEEN(1,137))","v":"West"},"FD9675"]
[null,{"$f":"INDEX(UpK,RANDBETWEEN(1,16))&RANDBETWEEN(1000,9999)","v":"N9138"},{"$f":"INDEX(LstNm,RANDBETWEEN(1,137))","v":"Jones"},"MB5353"]

{"sheet":"Summary","index":1,"n_rows":31,"n_cols":4,"rows_kept":31,"cut":false,"hidden":false,"merged":[]}
[]
[null,"Table3"]
[null,"Invoice","NName","Model"]
[null,"B2295","Brown","NM1398, MD9135, GR9727"]
[null,"D4022","Johnson","MH8594, JS9551, VV8339, TG5634, WG4265, NN1592"]
[null,"F4443","Williams","DJ2284, MJ2894, DV1985, DJ8836, MJ1097, DK1474, SV3156, KW1896"]
[null,"F6360","Williams","HS6131, FL8723"]
[null,"F7379","Jones","NK8396, WS4267"]
[null,"F8638","Johnson","BH3396, NW9414"]
[null,"G4539","Smith","MF2402, RW3639, JN6993, KJ8586"]
[null,"G8764","Brown","WD3631, DP3966"]
[null,"J4018","Jones","RG7957, VP7963, JS4075, FP1952"]
[null,"K6645","Jones","BJ6877, VW8197, KM7186, VD1118, DB8761"]
[null,"K6722","Brown","VM3163, WP9207, FK1981, KP8679"]
[null,"K8971","Jones","FW1904, VL3657"]
[null,"L1269","Williams","MF3994, GR6038, WJ6921, BN2246"]
[null,"L3367","Smith","GJ9830, VR4079"]
[null,"M2467","Johnson","FW2439, FB1978, MM1892, WW2069"]
[null,"M6827","Smith","FM5205, TJ4220, SB6775, LM7161"]
[null,"N2321","Brown","RL3059, LT9038, VR2031, MJ8466, SN3877, RR6487"]
[null,"N6026","Johnson","LP5782, FM2645"]
[null,"N7259","Brown","SF2076, DV5203, WF7804, LB7078"]
[null,"P8139","Johnson","BD4859, GD8621, KP6640, HM7841, TL3760"]
[null,"R1994","Smith","JB8855, VJ4770, LM3582, GW5635, VV4869, LB1367, PD8650"]
[null,"R3002","Williams","LG8791, LH2246"]
[null,"R7783","Williams","LF6228, MF1356, HF5664, JB6548"]
[null,"T3604","Jones","TW9011, TV2722, BG1881, LF8268, BG7674, JK1638"]
[null,"V6492","Smith","LN5025, LF1259, KN2952"]
[null,"G8931","Parker","FV8761"]
[null,"D1194","Foster","HN4867"]
[null,"B6340","Green","WM6064"]

{"sheet":"Summary2","index":2,"n_rows":31,"n_cols":11,"rows_kept":31,"cut":false,"hidden":false,"merged":[]}
["For this version see",null,"Summary2"]
[null,"Table3"]
[null,"Invoice","NName","1","2","3","4","5","6","7","8"]
[null,"B2295","Brown","MJ9918","FR1730","BL8323"]
[null,"D4022","Johnson","FT5643","KP7292","FM8130","HJ4338","KR6202","SS8429"]
[null,"F4443","Williams","FR1992","HM1940","TW8235","KK9986","TJ3261","VW9682","DG3102","NR8935"]
[null,"F6360","Williams","TP9932","WB8341"]
[null,"F7379","Jones","MS4684","TL9651"]
[null,"F8638","Johnson","DV3842","LF2102"]
[null,"G4539","Smith","VR9158","FN3533","WV3736","NH8505"]
[null,"G8764","Brown","MV4006","NM1608"]
[null,"J4018","Jones","KB6297","LH1819","PG2836","GG7612"]
[null,"K6645","Jones","LV2805","SN8380","DV6609","VB8398","TB2407"]
[null,"K6722","Brown","MJ5536","LB1158","SN3467","MW2987"]
[null,"K8971","Jones","SS8385","PM2383"]
[null,"L1269","Williams","WF2463","TN2420","TK2202","NW9777"]
[null,"L3367","Smith","GV4019","BM4867"]
[null,"M2467","Johnson","GS5251","BD5967","DS3692","SR3378"]
[null,"M6827","Smith","DL3605","RJ2201","HF7788","BS8523"]
[null,"N2321","Brown","VP8849","LB9780","RR2130","GK9879","GR2434","FP4908"]
[null,"N6026","Johnson","TV5545","KW3990"]
[null,"N7259","Brown","WR7034","FB2520","TP5417","JL9613"]
[null,"P8139","Johnson","SJ9956","RL4530","KV7309","PF3931","LD4484"]
[null,"R1994","Smith","DG3030","KW4885","FL3288","SK6244","FR9284","KM3581","HP7298"]
[null,"R3002","Williams","NF9341","KW5749"]
[null,"R7783","Williams","NS2599","RF1767","RL4147","KH7204"]
[null,"T3604","Jones","DL5642","BL7892","GG8111","VV7320","GL5640","NT7749"]
[null,"V6492","Smith","KL1585","TL3688","LT1616"]
[null,"D1011","Jenkins","RP8274"]
[null,"J4283","Ramirez","NT9746"]
[null,"N9150","Wright","NH8926"]